{"text_format":"1","workbook":"xlsx","n_sheets":8,"sheets":["2011","2010","2009","2008","2007","2006","2005","Augusta"],"not_rendered":{"charts":0,"images":12,"macros":1,"external_links":0,"defined_names":1,"comments":6,"pivot_tables":0},"unopened":[],"bounds":{"document_bytes":16777216,"sheet_cells":100000,"rows_first":2000,"rows_last":500,"rows_between":2000,"halvings":0,"cell_chars":16384,"cell_head_chars":4096},"cells_cut":0,"cells_raw":0,"read":"whole","date_system":"1900"}

{"sheet":"2011","index":0,"n_rows":72,"n_cols":48,"rows_kept":72,"cut":false,"hidden":false,"merged":[[0,1,5,1],[0,2,5,41],[6,2,8,2],[6,3,8,3],[6,5,8,5],[6,31,8,31],[6,7,8,7],[6,9,8,9],[6,11,8,11],[6,13,8,13],[49,0,49,1],[45,0,45,42],[0,0,11,0],[46,0,46,1],[6,4,8,4],[6,6,8,6],[47,0,47,1],[48,0,48,1],[8,1,11,1],[6,8,8,8],[6,15,8,15],[6,17,8,17],[6,20,8,20],[6,12,8,12],[6,18,8,18],[6,14,8,14],[6,16,8,16],[6,21,8,21],[6,10,8,10],[6,19,8,19],[6,36,8,36],[6,23,8,23],[6,30,8,30],[6,32,8,32],[6,29,8,29],[6,35,8,35],[6,25,8,25],[6,22,8,22],[6,37,8,37],[6,40,8,40],[6,33,8,33],[6,24,8,24],[6,39,8,39],[6,34,8,34],[6,38,8,38],[6,28,8,28],[6,26,8,26],[3,55,5,55],[6,27,8,27],[11,61,13,61],[3,59,5,59],[3,58,5,58],[6,41,8,41],[3,57,5,57],[11,64,13,64],[11,62,13,62],[6,42,11,42],[11,54,13,54],[11,69,13,69],[11,65,13,65],[11,56,13,56],[11,57,13,57],[3,72,5,72],[3,67,5,67],[3,63,5,63],[3,68,5,68],[3,66,5,66],[3,65,5,65],[3,71,5,71],[3,70,5,70],[3,69,5,69],[3,85,5,85],[11,75,13,75],[3,73,5,73],[3,80,5,80],[11,78,13,78],[11,79,13,79],[3,74,5,74],[11,73,13,73],[11,77,13,77],[3,82,5,82],[11,81,13,81],[11,89,13,89],[3,83,5,83],[11,86,13,86],[11,87,13,87],[3,84,5,84],[11,84,13,84],[11,85,13,85],[11,83,13,83]]}
[null,null,"Masters Friday 2011"]
[]
[]
[]
[]
[]
[null,null,"Pine Forest Score","CABRERA","CHOI","CINK","CLARK","COUPLES","DONALD","ELS","FOWLER","GOOSEN","HARRINGTON","IMMELMAN","ISHIKAWA","JOHNSON, D","KAYMER","KIM","KUCHAR","LAIRD","MAHAN","MARINO","MCDOWELL","MCILROY","MOLINARI F","MOORE","MICKELSON","O'HAIR","OVERTON","POULTER","ROSE","SCHWARTZEL","SINGH","TOMS","VILLEGAS","WATNEY","WATSON B","WATSON T","WESTWOOD","WOODLAND","WOODS","YANG","Combined MFC & PGA Totals"]
[]
[null,"MFC Golfer"]
[null,null,"Thursday",-1,-5,-1,1,-1,0,3,-2,-2,5,-3,-1,2,6,1,-4,2,3,2,2,-7,2,-2,-2,-2,1,2,1,-3,4,0,-2,0,1,7,0,-3,-1,-5]
[null,null,"Friday",-2,-2,3,1,-4,-4,-2,-3,6,0,1,-1,-4,0,1,3,-3,-1,-1,1,-3,-1,1,0,4,0,-3,-1,-1,6,-3,5,0,-1,0,-5,1,-6,0]
[null,null,"Thru",{"$f":"VLOOKUP(D$7,$AT:$AV,3,FALSE)","v":"F"},{"$f":"VLOOKUP(E$7,$AT:$AV,3,FALSE)","v":"F"},"F","F","F","F","F","F","F","F","F","F","F","F","F","F","F","F","F","F","F","F","F","F","F","F","F","F","F","F","F","F","F","F","F","F","F","F","F"]
[1,"Mike Gandolfo**",-7.5,null,{"$f":"E$11+E$10","v":-7},null,null,null,null,null,null,null,null,null,null,null,null,{"$f":"R$11+R$10","v":2},null,null,null,null,null,null,null,null,null,null,null,null,null,null,null,null,null,null,null,null,null,null,{"$f":"AO$11+AO$10","v":-7},{"$f":"AP$11+AP$10","v":-5},{"$f":"SUM(C13:AP13)","v":-24.5}]
[{"$f":"A13+1","v":2},"Mark McNulty",-6,null,null,null,null,{"$f":"H$11+H$10","v":-5},null,null,null,null,null,null,{"$f":"O$11+O$10","v":-2},null,null,null,null,null,null,null,null,null,null,null,null,null,null,null,null,null,null,null,null,{"$f":"AJ$11+AJ$10","v":0},null,null,null,null,{"$f":"AO$11+AO$10","v":-7},null,-20]
[{"$f":"A14+1","v":3},"Mike Maggi",-9,{"$f":"D$11+D$10","v":-3},null,null,null,null,{"$f":"I$11+I$10","v":-4},null,null,null,null,null,{"$f":"O$11+O$10","v":-2},null,null,null,null,null,null,null,null,null,null,null,null,null,null,null,null,null,null,null,null,null,{"$f":"AK$11+AK$10","v":0},null,null,null,null,null,-18]
[4,"Don Vrba",-3,{"$f":"D$11+D$10","v":-3},{"$f":"E$11+E$10","v":-7},null,null,null,null,null,null,null,null,null,null,null,null,{"$f":"R$11+R$10","v":2},null,null,null,null,null,null,null,null,null,null,null,null,null,null,null,null,null,null,null,null,{"$f":"AM$11+AM$10","v":-5},null,null,null,-16]
[5,"Davis Scarborough",-10.5,null,null,null,null,null,null,null,null,null,null,null,null,{"$f":"P$11+P$10","v":-2},null,null,null,null,null,null,null,null,null,{"$f":"Z$11+Z$10","v":-1},{"$f":"AA$11+AA$10","v":-2},null,null,null,null,null,null,null,null,null,{"$f":"AK$11+AK$10","v":0},null,null,null,null,null,-15.5]
[6,"Tom Pope",-1.5,null,{"$f":"E$11+E$10","v":-7},null,null,null,null,null,null,null,null,null,null,{"$f":"P$11+P$10","v":-2},null,null,null,null,null,null,null,null,null,null,{"$f":"AA$11+AA$10","v":-2},null,null,null,null,null,null,null,null,{"$f":"AJ$11+AJ$10","v":0},null,null,null,null,null,null,-12.5,null,"Robert Allenby","Allenby",{"$f":"IF(VLOOKUP($AS18,Augusta!$B:$I,6,FALSE)=\"E\",0,VLOOKUP($AS18,Augusta!$B:$I,6,FALSE))","v":3},{"$f":"VLOOKUP($AS18,Augusta!$B:$I,7,FALSE)","v":"F"}]
[7,"Carl Berlinger",-12,null,null,null,null,null,null,null,null,null,null,null,null,null,null,null,null,null,{"$f":"U$11+U$10","v":2},null,null,null,null,null,{"$f":"AA$11+AA$10","v":-2},null,null,null,null,null,null,null,null,{"$f":"AJ$11+AJ$10","v":0},{"$f":"AK$11+AK$10","v":0},null,null,null,null,null,-12,null,"Angel Cabrera","Cabrera",{"$f":"IF(VLOOKUP($AS19,Augusta!$B:$I,6,FALSE)=\"E\",0,VLOOKUP($AS19,Augusta!$B:$I,6,FALSE))","v":-1},{"$f":"VLOOKUP($AS19,Augusta!$B:$I,7,FALSE)","v":"F"}]
[8,"Andy Turner",-9,null,null,null,null,null,null,null,null,null,null,null,null,{"$f":"P$11+P$10","v":-2},null,null,null,null,{"$f":"U$11+U$10","v":2},null,null,null,null,null,{"$f":"AA$11+AA$10","v":-2},null,null,null,null,null,null,null,null,{"$f":"AJ$11+AJ$10","v":0},null,null,null,null,null,null,-11,null,"Chad Campbell","Campbell",{"$f":"IF(VLOOKUP($AS20,Augusta!$B:$I,6,FALSE)=\"E\",0,VLOOKUP($AS20,Augusta!$B:$I,6,FALSE))","v":{"$error":"#N/A"}},{"$f":"VLOOKUP($AS20,Augusta!$B:$I,7,FALSE)","v":{"$error":"#N/A"}}]
{"$rows_left_out":53}
{"sheet":"2010","index":1,"n_rows":55,"n_cols":51,"rows_kept":55,"cut":false,"hidden":false,"merged":[[0,0,5,0],[0,1,5,39],[6,2,8,2],[6,3,8,3],[6,4,8,4],[6,13,8,13],[6,18,8,18],[6,31,8,31],[6,9,8,9],[6,17,8,17],[6,27,8,27],[6,25,8,25],[6,5,8,5],[6,36,8,36],[6,21,8,21],[6,14,8,14],[6,33,8,33],[6,11,8,11],[6,8,8,8],[6,12,8,12],[6,40,11,40],[6,30,8,30],[6,15,8,15],[6,34,8,34],[6,1,8,1],[52,1,52,40],[48,0,48,40],[49,1,49,40],[50,1,50,40],[51,1,51,40],[6,39,8,39],[6,37,8,37],[6,26,8,26],[6,19,8,19],[6,38,8,38],[6,23,8,23],[6,35,8,35],[6,28,8,28],[6,32,8,32],[6,29,8,29],[6,10,8,10],[6,7,8,7],[6,24,8,24],[6,20,8,20],[8,0,11,0],[6,22,8,22],[6,16,8,16],[6,6,8,6]]}
[null,"Masters Friday 2010"]
[]
[]
[]
[]
[]
[null,"Pine Forest Score","ALLENBY","CABRERA","CAMpBELL","CASEY","CHOI","COUPLES","CURTIS","DONALD","DUVAL","ELS","FISHER","FURYK","GARCIA","GOOSEN","JHNSON D","JHNSON Z","KIM","KUCHAR","MAHAN","MARINO","MCDOWELL","MCILROY","MIKELSON","MOORE","OGILVY","O'HAIR","PERRY","QUIROS","SABITINI","SCHWTZEL","SCOTT","SINGH","STRICKER","VILLEGAS","WATNEY","WEIR","WESTWOOD","WOODS","Combined MFC & PGA Totals"]
[]
["MFC Golfer"]
[null,"Thursday",0,1,7,3,-5,-6,1,2,4,-1,5,8,2,2,-1,-2,-4,-2,-1,-1,3,2,-5,0,2,0,0,3,3,-3,-3,4,1,2,-4,-1,-5,-4]
[null,"Friday",3,2,-4,6,-1,3,3,3,3,1,4,4,-2,-1,0,2,-2,1,-1,1,2,5,-1,1,0,-1,-1,3,6,4,3,6,1,0,4,0,-3,-2]
[null,"Thru","F","F","F","F","F","F","F","F","F","F","F","F","F","F","F","F","F","F","F","F","F","F","F","F","F","F","F","F","F","F","F","F","F","F","F","F","F","F"]
["Ronny Byrd",-22.5,null,null,null,null,null,null,null,null,null,null,null,null,null,null,null,null,{"$f":"S$11+S$10","v":-6},null,{"$f":"U$11+U$10","v":-2},null,null,null,{"$f":"Y$11+Y$10","v":-6},null,null,null,null,null,null,{"$f":"AF$11+AF$10","v":1},null,null,null,null,null,null,null,null,{"$f":"SUM(B13:AN13)","v":-35.5}]
["Steve Robinson",-21,null,null,null,null,{"$f":"G$11+G$10","v":-6},null,null,null,null,{"$f":"L$11+L$10","v":0},null,null,null,null,null,null,{"$f":"S$11+S$10","v":-6},null,null,null,null,null,null,null,null,null,null,null,null,null,null,null,null,{"$f":"AJ$11+AJ$10","v":2},null,null,null,null,-31]
["Tim Waikem",-16.5,null,null,null,null,null,null,null,null,null,null,null,null,null,null,null,null,{"$f":"S$11+S$10","v":-6},null,null,null,null,null,null,null,null,null,null,null,null,{"$f":"AF$11+AF$10","v":1},null,null,null,{"$f":"AJ$11+AJ$10","v":2},null,null,null,{"$f":"AN$11+AN$10","v":-6},-25.5]
["Davis Scarborough",-21,null,null,null,null,null,null,null,null,null,null,null,null,null,{"$f":"P$11+P$10","v":1},null,null,null,null,null,null,null,null,{"$f":"Y$11+Y$10","v":-6},null,{"$f":"AA$11+AA$10","v":2},{"$f":"AB$11+AB$10","v":-1},null,null,null,null,null,null,null,null,null,null,null,null,-25]
["Eric Lauritzen**",-12,null,null,null,null,null,null,null,null,null,null,null,null,null,null,{"$f":"Q$11+Q$10","v":-1},null,{"$f":"S$11+S$10","v":-6},null,null,null,null,null,null,null,{"$f":"AA$11+AA$10","v":2},null,null,null,null,null,null,null,null,null,null,null,{"$f":"AM$11+AM$10","v":-8},null,-25]
["Matt Stone",-12,null,null,null,null,null,null,null,null,null,null,null,null,null,{"$f":"P$11+P$10","v":1},null,null,{"$f":"S$11+S$10","v":-6},null,null,null,null,null,null,null,null,null,null,null,null,{"$f":"AF$11+AF$10","v":1},null,null,null,null,null,null,{"$f":"AM$11+AM$10","v":-8},null,-24,null,null,"Robert Allenby",null,{"$f":"VLOOKUP($AR18,#REF!,7,FALSE)","v":{"$error":"#REF!"}},"Allenby"]
["Tom Pope",-19.5,null,{"$f":"D$11+D$10","v":3},null,null,null,null,null,null,null,{"$f":"L$11+L$10","v":0},null,null,null,null,null,null,{"$f":"S$11+S$10","v":-6},null,null,null,null,null,null,null,null,null,{"$f":"AC$11+AC$10","v":-1},null,null,null,null,null,null,null,null,null,null,null,-23.5,null,null,"Angel Cabrera",{"$f":"IF(VLOOKUP($AR19,#REF!,6,FALSE)=\"E\",0,VLOOKUP($AR19,#REF!,6,FALSE))","v":{"$error":"#REF!"}},{"$f":"VLOOKUP($AR19,#REF!,7,FALSE)","v":{"$error":"#REF!"}},"Cabrera",null,null,null,{"$f":"AS19","v":{"$error":"#REF!"}}]
["Nicole Cooper",-10.5,null,null,null,null,null,null,null,null,null,null,null,null,null,{"$f":"P$11+P$10","v":1},null,null,{"$f":"S$11+S$10","v":-6},null,null,null,null,null,null,null,null,null,null,null,null,null,{"$f":"AG$11+AG$10","v":0},null,null,null,null,null,{"$f":"AM$11+AM$10","v":-8},null,-23.5,null,null,"Chad Campbell",{"$f":"IF(VLOOKUP($AR20,#REF!,6,FALSE)=\"E\",0,VLOOKUP($AR20,#REF!,6,FALSE))","v":{"$error":"#REF!"}},{"$f":"VLOOKUP($AR20,#REF!,7,FALSE)","v":{"$error":"#REF!"}},"Campbell",null,null,null,{"$error":"#REF!"}]
{"$rows_left_out":36}
{"sheet":"2009","index":2,"n_rows":109,"n_cols":34,"rows_kept":109,"cut":false,"hidden":false,"merged":[[0,0,5,0],[0,1,5,26],[6,1,9,1],[6,2,8,2],[6,3,8,3],[6,5,8,5],[6,10,8,10],[6,11,8,11],[6,12,8,12],[46,1,46,27],[6,6,8,6],[6,7,8,7],[6,8,8,8],[6,13,8,13],[6,15,8,15],[6,19,8,19],[6,20,8,20],[6,16,8,16],[6,18,8,18],[45,1,45,27],[6,26,8,26],[6,27,10,27],[6,21,8,21],[6,22,8,22],[6,23,8,23],[6,14,8,14],[6,9,8,9],[6,24,8,24],[42,0,42,27],[44,1,44,27],[6,25,8,25],[6,17,8,17],[8,0,10,0],[43,1,43,27],[6,4,8,4]]}
[null,"Masters Friday 2009"]
[]
[]
[]
[]
[]
[null,"Pine Forest Score","HARNGTN","POULTER","WEIR","GARCIA","MIEKLSN","GOOSEN","CLARK","WATNEY","MCILROY","PERRY","WSTWOOD","CAMPBEL","STENSON","SINGH","KARLSON","CINK","OGILVY","ELS","JOHNSON","SUTRLND","O'HAIR","MAHAN","CASEY","KIM","COUPLES","Combined MFC & PGA Totals"]
[]
["MFC Golfer"]
[null,null,1,1,3,-5,-4,-1,-1,-1,1,-5,"E",-2,-2,-2,2,6,-2,-1,8,4,4,3,"E",-7,1]
[null,"Thru","F","F","F","F","F","F","F","F","F","F","F","F","F","F","F","F","F","F","F","F","F","F","F","F","F"]
["Frank McGill**",-9,null,null,null,null,null,null,null,null,null,null,null,null,null,null,null,null,{"$f":"S$10","v":-2},null,null,null,null,null,null,{"$f":"Z$10","v":-7},null,{"$f":"SUM(B12:AA12)","v":-18}]
["Davis Scarborough",-9,null,null,null,null,{"$f":"G$10","v":-4},null,null,null,null,null,null,null,null,null,null,null,-2,null,null,null,null,null,null,null,null,-15,null,null,null,null,"Score","Thru"]
["Don Vrba Sr.",-9,null,null,null,null,{"$f":"G$10","v":-4},null,null,null,null,null,null,null,null,null,null,null,-2,null,null,null,null,null,null,null,null,-15,null,null,"Aaron Baddeley",null,{"$f":"VLOOKUP($AE14,#REF!,6,FALSE)","v":{"$error":"#REF!"}},{"$f":"VLOOKUP($AE14,#REF!,7,FALSE)","v":{"$error":"#REF!"}}]
["Mark Ingebrigtson",-6,null,null,null,{"$f":"F$10","v":-5},null,null,null,null,null,null,null,null,null,null,null,null,-2,null,null,null,null,null,null,null,null,-13,null,null,"Adam Scott",null,{"$f":"VLOOKUP($AE15,#REF!,6,FALSE)","v":{"$error":"#REF!"}},{"$f":"VLOOKUP($AE15,#REF!,7,FALSE)","v":{"$error":"#REF!"}}]
["Don Vrba Jr.",-9,null,null,null,null,null,null,null,null,null,null,null,null,null,null,null,null,-2,null,null,null,null,null,{"$f":"Y$10","v":"E"},null,null,-11,null,null,"Alvaro Quiros",null,{"$f":"VLOOKUP($AE16,#REF!,6,FALSE)","v":{"$error":"#REF!"}},{"$f":"VLOOKUP($AE16,#REF!,7,FALSE)","v":{"$error":"#REF!"}}]
["Kim Phillips",-1,null,null,null,null,null,null,null,null,null,null,null,null,null,null,null,null,-2,null,null,null,null,null,null,{"$f":"Z$10","v":-7},null,-10,null,null,"Andres Romero",null,{"$f":"VLOOKUP($AE17,#REF!,6,FALSE)","v":{"$error":"#REF!"}},{"$f":"VLOOKUP($AE17,#REF!,7,FALSE)","v":{"$error":"#REF!"}}]
["Matt Stone",-6,null,null,null,null,null,null,null,{"$f":"J$10","v":-1},null,null,null,null,null,{"$f":"P$10","v":-2},null,null,null,null,null,null,null,null,null,null,null,-9,null,null,"Angel Cabrera",null,{"$f":"VLOOKUP($AE18,#REF!,6,FALSE)","v":{"$error":"#REF!"}},{"$f":"VLOOKUP($AE18,#REF!,7,FALSE)","v":{"$error":"#REF!"}}]
["Steve Robinson",-3,null,null,null,null,null,null,null,null,{"$f":"K$10","v":1},null,null,null,null,null,null,null,null,null,null,null,null,null,null,{"$f":"Z$10","v":-7},null,-9,null,null,"Anthony Kim",null,{"$f":"VLOOKUP($AE19,#REF!,6,FALSE)","v":{"$error":"#REF!"}},{"$f":"VLOOKUP($AE19,#REF!,7,FALSE)","v":{"$error":"#REF!"}}]
["Mike Walter",-5,null,null,null,null,null,null,{"$f":"I$10","v":-1},null,null,null,null,null,null,null,null,null,{"$f":"S$10","v":-2},null,null,null,null,null,null,null,null,-8,null,null,"Ben Crenshaw",null,{"$f":"VLOOKUP($AE20,#REF!,6,FALSE)","v":{"$error":"#REF!"}},{"$f":"VLOOKUP($AE20,#REF!,7,FALSE)","v":{"$error":"#REF!"}}]
{"$rows_left_out":90}
{"sheet":"2008","index":3,"n_rows":106,"n_cols":35,"rows_kept":106,"cut":false,"hidden":false,"merged":[[0,0,5,0],[0,1,5,27],[6,1,9,1],[6,2,8,2],[6,3,8,3],[6,4,8,4],[6,5,8,5],[6,6,8,6],[6,7,8,7],[6,8,8,8],[46,1,46,28],[6,23,8,23],[6,11,8,11],[6,14,8,14],[6,15,8,15],[6,18,8,18],[6,22,8,22],[42,0,42,28],[43,1,43,28],[6,24,8,24],[6,27,8,27],[8,0,10,0],[6,12,8,12],[6,17,8,17],[6,10,8,10],[6,13,8,13],[6,19,8,19],[44,1,44,28],[45,1,45,28],[6,25,8,25],[6,26,8,26],[6,20,8,20],[6,21,8,21],[6,9,8,9],[6,16,8,16],[6,28,10,28]]}
[null,"Masters Friday 2008"]
[]
[]
[]
[]
[]
[null,"Pine Forest Score","HARNGTN","FURYK","WEIR","SCOTT","MIEKLSN","GOOSEN","APPLEBY","ROSE","BADDLEY","STRICKR","DONALD","POULTER","STENSON","SINGH","SABATNI","AMES","OGILVY","ELS","JOHNSON","IMMELMN","SNDEKER","OLAZBAL","CASEY","CHOI","COUPLES","ROMERO","Combined MFC & PGA Totals"]
[]
["MFC Golfer"]
[null,null,-1,1,-4,-1,-4,-1,-2,6,1,5,3,-3,1,-1,2,-2,-1,2,4,-4,-4,3,-3,3,"E","E"]
[null,"Thru","F","F","F","F","F","F","F","F","F","F","F","F","F","F","F","F","F","F","F","F","F","F","F","F","F","F"]
["Walter Smedley**",-9,null,null,null,null,null,null,null,null,null,null,null,{"$f":"N$10","v":-3},null,null,null,null,null,null,null,null,{"$f":"W$10","v":-4},null,null,null,null,null,{"$f":"SUM(B12:AB12)","v":-16}]
["Heidi Walter",-9,null,null,{"$f":"E$10","v":-4},{"$f":"F$10","v":-1},null,null,null,null,null,null,null,null,null,null,null,null,null,null,null,null,null,null,null,null,null,null,-14]
["Davis Scarborough",-5,null,null,null,null,{"$f":"G$10","v":-4},null,null,null,null,null,null,null,null,null,null,null,null,null,null,{"$f":"V$10","v":-4},null,null,null,null,null,null,-13,null,null,"Aaron Baddeley",null,{"$f":"VLOOKUP($AF14,#REF!,4,FALSE)","v":{"$error":"#REF!"}},{"$f":"VLOOKUP($AF14,#REF!,3,FALSE)","v":{"$error":"#REF!"}}]
["Craig Heiser",-9,null,null,null,null,null,null,null,null,null,null,null,null,null,null,null,null,null,null,null,null,null,null,{"$f":"Y$10","v":-3},null,null,{"$f":"AB$10","v":"E"},-12,null,null,"Adam Scott",null,{"$f":"VLOOKUP(AF15,#REF!,4,FALSE)","v":{"$error":"#REF!"}},{"$f":"VLOOKUP($AF15,#REF!,3,FALSE)","v":{"$error":"#REF!"}}]
["Jenny Murdock",-4,null,null,{"$f":"E$10","v":-4},null,{"$f":"G$10","v":-4},null,null,null,null,null,null,null,null,null,null,null,null,null,null,null,null,null,null,null,null,null,-12,null,null,"Anders Hansen",null,{"$f":"VLOOKUP(AF16,#REF!,4,FALSE)","v":{"$error":"#REF!"}},{"$f":"VLOOKUP($AF16,#REF!,3,FALSE)","v":{"$error":"#REF!"}}]
["Travis Lauritsen",-11,null,null,null,null,null,null,null,null,null,null,null,null,{"$f":"O$10","v":1},null,null,null,{"$f":"S$10","v":-1},null,null,null,null,null,null,null,null,null,-11,null,null,"Andres Romero",null,{"$f":"VLOOKUP(AF17,#REF!,4,FALSE)","v":{"$error":"#REF!"}},{"$f":"VLOOKUP($AF17,#REF!,3,FALSE)","v":{"$error":"#REF!"}}]
["Peter Dennis",-12,null,null,null,null,null,null,null,null,null,null,{"$f":"M$10","v":3},null,null,null,null,null,{"$f":"S$10","v":-1},null,null,null,null,null,null,null,null,null,-10,null,null,"Angel Cabrera",null,{"$f":"VLOOKUP(AF18,#REF!,4,FALSE)","v":{"$error":"#REF!"}},{"$f":"VLOOKUP($AF18,#REF!,3,FALSE)","v":{"$error":"#REF!"}}]
["Ric Booth ",-7,null,null,null,null,null,{"$f":"H$10","v":-1},null,null,null,null,null,null,null,null,null,null,{"$f":"S$10","v":-1},null,null,null,null,null,null,null,null,null,-9,null,null,"Arron Oberholser",null,{"$f":"VLOOKUP(AF19,#REF!,4,FALSE)","v":{"$error":"#REF!"}},{"$f":"VLOOKUP($AF19,#REF!,3,FALSE)","v":{"$error":"#REF!"}}]
["Andy Turner",-6,null,null,null,null,null,{"$f":"H$10","v":-1},null,null,null,null,null,null,null,null,null,{"$f":"R$10","v":-2},null,null,null,null,null,null,null,null,null,null,-9,null,null,"Ben Crenshaw",null,{"$f":"VLOOKUP(AF20,#REF!,4,FALSE)","v":{"$error":"#REF!"}},{"$f":"VLOOKUP($AF20,#REF!,3,FALSE)","v":{"$error":"#REF!"}}]
{"$rows_left_out":87}
{"sheet":"2007","index":4,"n_rows":39,"n_cols":22,"rows_kept":39,"cut":false,"hidden":false,"merged":[[6,16,8,16],[6,15,8,15],[0,0,5,0],[0,1,5,20],[6,2,8,2],[6,3,8,3],[6,4,8,4],[6,5,8,5],[6,18,8,18],[8,0,9,0],[6,1,9,1],[38,1,38,21],[6,8,8,8],[6,17,8,17],[6,11,8,11],[6,12,8,12],[6,9,8,9],[34,0,34,21],[6,20,8,20],[37,1,37,21],[6,13,8,13],[6,6,8,6],[6,7,8,7],[6,14,8,14],[6,21,9,21],[35,1,35,21],[6,19,8,19],[36,1,36,21],[6,10,8,10]]}
[null,"Masters Friday 2007"]
[]
[]
[]
[]
[]
[null,"Pine Forest Score","SINGH","FURYK","MICKELS","ELS","ROSE","OGILVY","SCOTT","DONALD","BADDLEY","GOOSEN","STENSON","LOVE","SABTINI","OLZABL","DIMARCO","BEEM","TOMS","WETRICH","HOWELL","Combined MFC & PGA Totals"]
[]
["MFC Golfer"]
[null,null,-1,-1,1,3,3,-2,6,2,0,4,4,5,4,3,6,9,6,1,5]
["Eric Lauritzen",-7,{"$f":"$C$10","v":-1},null,{"$f":"$E$10","v":1},null,null,null,null,null,null,null,null,null,null,null,null,null,null,null,null,{"$f":"SUM(B11:U11)","v":-7}]
["Mark \"Ingy\"",0,{"$f":"$C$10","v":-1},null,null,null,null,{"$f":"$H$10","v":-2},null,null,null,null,null,null,null,null,null,null,null,null,null,-3]
["Andy Turner",-2,{"$f":"$C$10","v":-1},null,{"$f":"$E$10","v":1},null,null,null,null,null,null,null,null,null,null,null,null,null,null,null,null,-2]
["Peter Dennis",0,{"$f":"$C$10","v":-1},{"$f":"$D$10","v":-1},null,null,null,null,null,null,null,null,null,null,null,null,null,null,null,null,null,-2]
["Tim Waikem",-7,{"$f":"$C$10","v":-1},null,null,null,null,null,null,null,null,null,null,null,null,null,null,null,{"$f":"$S$10","v":6},null,null,-2]
["Gene Brumbelow",-2,null,null,null,null,{"$f":"$G$10","v":3},{"$f":"$H$10","v":-2},null,null,null,null,null,null,null,null,null,null,null,null,null,-1]
["Jenny Murdock",-5,null,{"$f":"$D$10","v":-1},null,null,null,null,null,null,null,null,null,null,null,null,{"$f":"$Q$10","v":6},null,null,null,null,0]
["Mark Murdock",-2,null,{"$f":"$D$10","v":-1},null,null,null,null,null,null,null,null,null,null,null,{"$f":"$P$10","v":3},null,null,null,null,null,0]
["Craig Heiser",-1,null,null,null,null,null,{"$f":"$H$10","v":-2},null,null,null,null,{"$f":"$M$10","v":4},null,null,null,null,null,null,null,null,1]
["Danny Tinkler",-5,null,null,null,null,null,null,null,null,null,null,null,null,null,null,null,null,{"$f":"$S$10","v":6},{"$f":"$T$10","v":1},null,2]
{"$rows_left_out":20}
{"sheet":"2006","index":5,"n_rows":38,"n_cols":20,"rows_kept":38,"cut":false,"hidden":false,"merged":[[0,0,5,0],[0,1,5,18],[6,1,9,1],[6,2,8,2],[6,3,8,3],[6,4,8,4],[6,5,8,5],[6,6,8,6],[6,17,8,17],[6,12,8,12],[6,14,8,14],[6,18,8,18],[6,10,8,10],[8,0,9,0],[6,16,8,16],[6,15,8,15],[6,9,8,9],[36,1,36,19],[6,19,9,19],[37,1,37,19],[6,7,8,7],[6,8,8,8],[34,1,34,19],[35,1,35,19],[33,0,33,19],[6,11,8,11],[6,13,8,13]]}
[null,"Masters Friday 2006"]
[]
[]
[]
[]
[]
[null,"Pine Forest Score","CAMBELL","APPLEBY","GOOSEN","CABRERA","GARCIA","MICKELS","OLZABLE","LEHMAN","STENSON","PETERSN","OBELHSR","SINGH","ELS","TOMS","JOHNSON","WEIR","COUPLES","Combined MFC & PGA Totals"]
[]
["MFC Golfer"]
[null,null,-5,3,1,2,2,0,-1,3,2,2,3,2,-1,6,0,1,-2]
["Rene Casadaban",-9,null,null,null,null,null,null,null,null,null,null,null,null,{"$f":"$O$10","v":-1},null,null,null,{"$f":"$S$10","v":-2},{"$f":"SUM(B11:S11)","v":-12}]
["R.L. Trailor",-10,null,null,null,null,null,{"$f":"$H$10","v":0},{"$f":"$I$10","v":-1},null,null,null,null,null,null,null,null,null,null,-11]
["Todd Riddle",-7,{"$f":"$C$10","v":-5},null,{"$f":"$E$10","v":1},null,null,null,null,null,null,null,null,null,null,null,null,null,null,-11]
["Andy Turner",-9,null,null,null,null,null,{"$f":"$H$10","v":0},null,null,null,null,null,null,{"$f":"$O$10","v":-1},null,null,null,null,-10]
["Shawn Wharton",-9,null,null,null,null,null,{"$f":"$H$10","v":0},{"$f":"$I$10","v":-1},null,null,null,null,null,null,null,null,null,null,-10]
["Staton ",-9,null,null,null,null,null,{"$f":"$H$10","v":0},{"$f":"$I$10","v":-1},null,null,null,null,null,null,null,null,null,null,-10]
["Ric Booth",-8,{"$f":"$C$10","v":-5},{"$f":"$D$10","v":3},null,null,null,null,null,null,null,null,null,null,null,null,null,null,null,-10]
["Waddy Hammond",-9,null,null,null,null,null,{"$f":"$H$10","v":0},null,null,null,null,null,null,null,null,{"$f":"$Q$10","v":0},null,null,-9]
["Mike Gandolfo**",-7,{"$f":"$C$10","v":-5},{"$f":"$D$10","v":3},null,null,null,null,null,null,null,null,null,null,null,null,null,null,null,-9]
["Gene Brumbelow",-6,{"$f":"$C$10","v":-5},null,null,{"$f":"$F$10","v":2},null,null,null,null,null,null,null,null,null,null,null,null,null,-9]
{"$rows_left_out":19}
{"sheet":"2005","index":6,"n_rows":17,"n_cols":20,"rows_kept":17,"cut":false,"hidden":false,"merged":[[6,4,8,18],[9,4,9,18],[16,1,16,19],[8,0,9,0],[13,1,13,19],[14,1,14,19],[15,1,15,19],[0,1,5,18],[6,19,9,19],[6,1,9,1],[6,2,8,2],[6,3,8,3]]}
[null,"Masters Friday 2005"]
[]
[]
[]
[]
[]
[null,"Cinco Ranch Score","WOOSS","DIMARCO","<<No Data Available>>",null,null,null,null,null,null,null,null,null,null,null,null,null,null,"Combined MFC & PGA Totals"]
[]
["MFC Golfer"]
[null,null,-6,-5]
["Michael Gandolfo",-7,{"$f":"C10","v":-6},{"$f":"D10","v":-5},null,null,null,null,null,null,null,null,null,null,null,null,null,null,null,{"$f":"SUM(B11:S11)","v":-18}]
[]
[]
["Format:","Scramble "]
["Venue:","The Golf Club At Cinco Ranch"]
["MFC Champion:","Michael Gandolfo"]
["Masters Winners:","Tiger Woods - Chris DiMarco"]

{"sheet":"Augusta","index":7,"n_rows":100,"n_cols":13,"rows_kept":100,"cut":false,"hidden":false,"merged":[]}
["Pos","Name",1,2,3,4,"Today","Thru","Total","Strokes"]
["T1","Rory McIlroy",65,"12:42:00","-","-",-7,"F",-7,65,null,null,"Formula needed for Row 11- Friday scores)"]
["T1","Alvaro Quiros",65,"10:41:00","-","-",-7,"F",-7,65,null,null,"=VLOOKUP(M$7,$AT:$AV,2,FALSE)"]
["T3","Y.E. Yang",67,"08:51:00","-","-",-5,"F",-5,67]
["T3","K.J. Choi",67,"10:19:00","-","-",-5,"F",-5,67,null,null,"Website Accessed in 2011 for MFC"]
["T5","Matt Kuchar",68,"13:26:00","-","-",-4,"F",-4,68,null,null,"http://sports.yahoo.com/golf/pga/players/Tom+Watson/59/scorecard/2011/15"]
["T5","Ricky Barnes",68,"09:13:00","-","-",-4,"F",-4,68]
["T7","Ross Fisher",69,"10:52:00","-","-",-3,"F",-3,69]
["T7","Brandt Snedeker",69,"11:25:00","-","-",-3,"F",-3,69]
["T7","Sergio Garcia",69,"13:59:00","-","-",-3,"F",-3,69]
["T7","Charl Schwartzel",69,"07:45:00","-","-",-3,"F",-3,69]
["T7","Trevor Immelman",69,"08:40:00","-","-",-3,"F",-3,69]
["T7","Geoff Ogilvy",69,"10:30:00","-","-",-3,"F",-3,69]
["T7","Gary Woodland",69,"10:41:00","-","-",-3,"F",-3,69]
["T14","Sean O'Hair",70,"10:52:00","-","-",-2,"F",-2,70]
["T14","Camilo Villegas",70,"11:14:00","-","-",-2,"F",-2,70]
["T14","Gregory Havret",70,"12:20:00","-","-",-2,"F",-2,70]
["T14","Rickie Fowler",70,"12:42:00","-","-",-2,"F",-2,70]
["T14","Hiroyuki Fujita",70,"12:53:00","-","-",-2,"F",-2,70]
["T14","Retief Goosen",70,"12:53:00","-","-",-2,"F",-2,70]
{"$rows_left_out":80}